{"text_format":"1","workbook":"xlsx","n_sheets":4,"sheets":["Intro","Data","Send","Lists"],"not_rendered":{"charts":0,"images":5,"macros":1,"external_links":0,"defined_names":0,"comments":0,"pivot_tables":0},"unopened":[],"bounds":{"document_bytes":16777216,"sheet_cells":100000,"rows_first":2000,"rows_last":500,"rows_between":2000,"halvings":0,"cell_chars":16384,"cell_head_chars":4096},"cells_cut":0,"cells_raw":0,"read":"whole","date_system":"1900"}

{"sheet":"Intro","index":0,"n_rows":39,"n_cols":5,"rows_kept":39,"cut":false,"hidden":false,"merged":[]}
[]
[null,"Datacollectie gebruik Lagevrio in het kader van een COVID-19 uitbraak in woonzorgcentra"]
[]
[]
[]
[]
[]
[]
[]
[]
[null,"Geachte CRA,"]
[]
[null,"Deze Excel-sheet wordt gebruikt voor de minimale datacollectie omtrent het gebruik van molnupiravir bij COVID-19 uitbraken in woonzorgcentra. "]
[null,"Meer info omtrent het gebruik van molnupiravir in het kader van COVID-19 uitbraken in woonzorgcentra vindt u hier. "]
[]
[null,"U kan deze Excel-sheet op 2 manieren gebruiken. "]
[]
[null,"Optie 1. Automatisch aggregeren van de data in excel"]
[null,"Ga naar het tabblad 'Data'. Vul voor elke individuele patiënt voor wie molnupiravir werd besteld in het kader van een COVID-19 uitbraak de gegevens in. "]
[null,"Het tabblad 'Data' dient enkel als hulpmiddel voor de CRA om de geaggregeerde gegevens te berekenen. Deze gegevens worden NIET meegestuurd naar Sciensano en de regionale gezondheidsautoriteiten. "]
[null,"Ga naar het tabblad 'Send'. Vul de gevraagde identificatiegegevens in van het woonzorgcentrum, de CRA en de persoon verantwoordelijk in het woonzorgcentrum bij afwezigheid van de CRA."]
[null,"Controleer of de geaggregeerde gegevens (cellen C27-C32) in het tabblad 'Send' correct zijn. "]
[null,"Verstuur de gegevens aan het einde van de uitbraak OF 28 dagen nadat de laatste behandeling met molnupiravir werd stopgezet (welk van beide het laatst komt) naar de regionale gezondheidsautoriteiten en Sciensano door op de knop 'Verzenden' te drukken. "]
[]
[null,"Optie 2. Manueel aggregeren van de data "]
[null,"Het tabblad 'Data' hoeft u niet te gebruiken. "]
[null,"Ga naar het tabblad 'Send'. Vul de gevraagde identificatiegegevens in van het woonzorgcentrum, de CRA en de persoon verantwoordelijk in het woonzorgcentrum bij afwezigheid van de CRA."]
[null,"Vul in de cellen C35-C40 de gevraagde geaggregeerde gegevens in. Controleer of de gegevens correct zijn. "]
[null,"Verstuur de gegevens aan het einde van de uitbraak OF 28 dagen nadat de laatste behandeling met molnupiravir werd stopgezet (welk van beide het laatst komt) naar de regionale gezondheidsautoriteiten en Sciensano door op de knop 'Verzenden' te drukken. "]
[]
[null,"Indien u de geaggregeerde data niet kan versturen via de verzendknop, kan u deze manueel versturen met als onderwerp 'Uitbraak COVID-19: data molnupiravir' aan de bevoegde regionale gezondheidsautoriteit EN Sciensano:"]
[]
[null,null,"Vlaanderen: ",null,"zorginfecties@vlaanderen.be"]
[null,null,"Wallonië:",null,"surveillance.sante@aviq.be"]
[null,null,"Brussel: ",null,"notif-hyg@ccc.brussels"]
[null,null,"Sciensano:",null,"antivirals@sciensano.be"]
[]
[]
[null,"Met veel dank voor uw inzet"]

{"sheet":"Data","index":1,"n_rows":5,"n_cols":10,"rows_kept":5,"cut":false,"hidden":false,"merged":[]}
[]
[null,"Datacollectie gebruik Lagevrio in het kader van een COVID-19 uitbraak in woonzorgcentra"]
[]
[]
[null,"Naam","Voornaam","Besteldatum Lagevrio\n(dd/mm/jjjj)","Behandeling met Lagevrio opgestart?(ja/nee)","Behandeling met Lagevrio voltooid (minstens 80%)?","Behandeld met Lagevrio EN overleden aan COVID in woonzorgcentrum?","Behandeld met Lagevrio EN gehospitaliseerd omwille van COVID?","Behandeld met Lagevrio EN overleden aan COVID in ziekenhuis?","Opmerkingen"]

{"sheet":"Send","index":2,"n_rows":47,"n_cols":3,"rows_kept":47,"cut":false,"hidden":false,"merged":[[41,1,43,2]]}
[]
[null,"Datacollectie gebruik Lagevrio in het kader van een COVID-19 uitbraak in woonzorgcentra"]
[]
[]
[null,"Woonzorgcentrum"]
[null,"Datum start uitbraak (eerste positieve test bij resident):"]
[null,"Naam woonzorgcentrum (site): "]
[null,"Postcode (site):"]
[null,"Gemeente (site):"]
[]
[null,"Coördinerend arts"]
[null,"Voornaam:"]
[null,"Naam:"]
[null,"RIZIV-Nr:"]
[null,"Telefoon:"]
[null,"E-mailadres:"]
[]
[null,"Verantwoordelijke persoon in het woonzorgcentrum in afwezigheid van coördinerend arts"]
[null,"Voornaam:"]
[null,"Naam:"]
[null,"Functie:"]
[null,"Telefoon:"]
[null,"E-mailadres:"]
[]
[null,"Geaggregeerde datacollectie"]
[null,"Optie 1. Automatische berekening op basis van het tabblad 'Input'"]
[null,"Aantal residenten voor wie Lagevrio werd besteld: ",{"$f":"COUNTA(Data!$D$6:$D$300)","v":0}]
[null,"Aantal residenten bij wie de behandeling met Lagevrio werd opgestart:",{"$f":"COUNTIF(Data!$E$6:$E$300,\"Ja\")","v":0}]
[null,"Aantal residenten bij wie de behandeling met Lagevrio werd voltooid (minstens 80%): ",{"$f":"COUNTIF(Data!$F$6:$F$300,\"Ja\")","v":0}]
[null,"Aantal residenten behandeld met Lagevrio die overleden zijn aan COVID-19 in woonzorgcentrum:",{"$f":"COUNTIF(Data!$G$6:$G$300,\"Ja\")","v":0}]
[null,"Aantal residenten behandeld met Lagevrio die werden gehospitaliseerd omwille van COVID-19:",{"$f":"COUNTIF(Data!$H$6:$H$300,\"Ja\")","v":0}]
[null,"Aantal residenten behandeld met Lagevrio die overleden zijn aan COVID-19 in ziekenhuis:",{"$f":"COUNTIF(Data!$I$6:$I$300,\"Ja\")","v":0}]
[]
[null,"Optie 2. Indien u de data zelf heeft geaggregeerd, kan u deze hieronder invullen:"]
[null,"Aantal residenten voor wie Lagevrio werd besteld: "]
[null,"Aantal residenten bij wie de behandeling met Lagevrio werd opgestart:"]
[null,"Aantal residenten bij wie de behandeling met Lagevrio werd voltooid (minstens 80%): "]
[null,"Aantal residenten behandeld met Lagevrio die overleden zijn aan COVID-19 in woonzorgcentrum:"]
[null,"Aantal residenten behandeld met Lagevrio die werden gehospitaliseerd omwille van COVID-19:"]
[null,"Aantal residenten behandeld met Lagevrio die overleden zijn aan COVID-19 in ziekenhuis:"]
[]
[null,"Opmerkingen: "]
[]
[]
[]
[null,"Door op de knop 'verzenden' te drukken verklaart u alle data te hebben gecontroleerd en dat alle residenten die behandeld werden met Lagevrio voldoen aan de criteria zoals beschreven in de SOP."]
[null,"De data worden ten vroegste doorverzonden 2 weken na het einde van de uitbraak OF 28 dagen na het beëindigen van de laatste behandeling, afhankelijk van wat het laatst komt.  "]

{"sheet":"Lists","index":3,"n_rows":3,"n_cols":4,"rows_kept":3,"cut":false,"hidden":true,"merged":[]}
["Geneesmiddelen","Opgestart","Hospitaal","Overleden"]
["Lagevrio","Ja","Ja","Ja"]
[null,"Nee","Nee","Nee"]