{"text_format":"1","workbook":"xlsx","n_sheets":4,"sheets":["Intro","Data","Send","Lists"],"not_rendered":{"charts":0,"images":5,"macros":1,"external_links":0,"defined_names":0,"comments":0,"pivot_tables":0},"unopened":[],"bounds":{"document_bytes":16777216,"sheet_cells":100000,"rows_first":2000,"rows_last":500,"rows_between":2000,"halvings":0,"cell_chars":16384,"cell_head_chars":4096},"cells_cut":0,"cells_raw":0,"read":"whole","date_system":"1900"}

{"sheet":"Intro","index":0,"n_rows":39,"n_cols":5,"rows_kept":39,"cut":false,"hidden":false,"merged":[]}
[]
[null,"Collecte de données sur l'utilisation de Lagevrio dans le contexte d'un foyer épidémique de COVID-19 dans des maisons de repos"]
[]
[]
[]
[]
[]
[]
[]
[]
[null,"Cher MCC, chère MCC,"]
[]
[null,"Cette Excel est utilisée pour la collecte de données minimales sur l'utilisation du molnupiravir dans les foyers épidemiques de COVID-19 dans les maisons de repos. "]
[null,"De plus amples informations sur l'utilisation du molnupiravir dans le contexte des épidémies de COVID-19 dans les établissements de soins résidentiels sont disponibles ici. "]
[]
[null,"Vous pouvez utiliser cette Excel de deux façons. "]
[]
[null,"Option 1. Agrégation automatique des données dans Excel"]
[null,"Allez dans l'onglet \"Data\". Saisissez les données pour chaque patient individuel pour lequel du molnupiravir a été commandé dans le cadre d'un foyer de COVID-19. "]
[null,"L'onglet \"Données\" sert uniquement d'outil à le MCC pour calculer les données agrégées. Ces données ne sont PAS envoyées à Sciensano ou aux autorités sanitaires régionales. "]
[null,"Allez dans l'onglet \"Send\". Remplissez les données d'identification demandées pour le maison de repos, le MCC et la personne responsable du centre de la maison de repos en l'absence du MCC."]
[null,"Vérifiez que les données agrégées (cellules C27-C32) dans l'onglet \"Send\" sont correctes. "]
[null,"Envoyez les données à la fin du foyer OU 28 jours après l'arrêt du dernier traitement au molnupiravir (selon la dernière éventualité) aux autorités sanitaires régionales et à Sciensano en cliquant sur le bouton \"Envoyer\". "]
[]
[null,"Option 2. Agrégation manuelle des données "]
[null,"Vous n'avez pas besoin d'utiliser l'onglet \"Data\". "]
[null,"Allez dans l'onglet \"Send\". Remplissez les données d'identification demandées pour la maison de repos, le MCC et la personne responsable de la maison de repos en l'absence du MCC."]
[null,"Entrez les données agrégées demandées dans les cellules C35-C40. Vérifiez si les données sont correctes. "]
[null,"Envoyez les données à la fin du foyer OU 28 jours après l'arrêt du dernier traitement au molnupiravir (selon la dernière éventualité) aux autorités sanitaires régionales et à Sciensano en cliquant sur le bouton \"Envoyer\". "]
[]
[null,"Si vous ne parvenez pas à envoyer les données agrégées via le bouton d'envoi, vous pouvez les envoyer manuellement avec l'objet \"Foyer COVID-19 : données molnupiravir\" à l'autorité sanitaire régionale compétente ET Sciensano :"]
[]
[null,null,"Flandre :",null,"zorginfecties@vlaanderen.be"]
[null,null,"Wallonie :",null,"surveillance.sante@aviq.be"]
[null,null,"Bruxelles : ",null,"notif-hyg@ccc.brussels"]
[null,null,"Sciensano :",null,"antivirals@sciensano.be"]
[]
[]
[null,"Merci  pour votre engagement"]

{"sheet":"Data","index":1,"n_rows":5,"n_cols":10,"rows_kept":5,"cut":false,"hidden":false,"merged":[]}
[]
[null,"Collecte de données sur l'utilisation de Lagevrio dans le contexte d'un foyer épidémique de COVID-19 dans des maisons de repos"]
[]
[]
[null,"Nom","Prénom","Date de commande de Lagevrio\n(jj/mm/aaaa)","Traitement avec Lagevrio débuté ? (oui/non)","Traitement avec Lagevrio complété (au moins 80%) ?","Traité avec Lagevrio ET décédé du COVID en maison de repos ?","Traité avec Lagevrio ET hospitalisé à cause du COVID ?","Traité avec Lagevrio ET décédé du COVID en hôpital ?","Remarques"]

{"sheet":"Send","index":2,"n_rows":47,"n_cols":3,"rows_kept":47,"cut":false,"hidden":false,"merged":[[41,1,43,2]]}
[]
[null,"Collecte de données sur l'utilisation de Lagevrio dans le contexte d'un foyer épidémique de COVID-19 dans des maisons de repos"]
[]
[]
[null,"Maison de repos"]
[null,"Date du debut d'un foyer (premier test positif chez le resident)"]
[null,"Nom maison de repos (site):"]
[null,"Code postal (site):"]
[null,"Municipalité (site):"]
[]
[null,"Médecin coordinateur et conseiller"]
[null,"Prénom:"]
[null,"Nom:"]
[null,"Numero INAMI:"]
[null,"Telephone: "]
[null,"Adresse e-mail:"]
[]
[null,"Personne responsable dans la maison de retraite en l'absence du médecin coordonnateur et conseiller:"]
[null,"Prénom: "]
[null,"Nom: "]
[null,"Fonction:"]
[null,"Telephone: "]
[null,"Adresse e-mail: "]
[]
[null,"Collecte de données agrégées"]
[null,"Option 1. Calcul automatique basé sur l'onglet \"Input\"."]
[null,"Nombre de residents pour lesquels Lagevrio a ete ordonne:",{"$f":"COUNTA(Data!$D$6:$D$300)","v":0}]
[null,"Nombre de residents pour lesquels un traitement par Lagevrio a ete initie :",{"$f":"COUNTIF(Data!$E$6:$E$300,\"Oui\")","v":0}]
[null,"Nombre de residents pour lesquels le traitement par Lagevrio est complete (au moins 80 %): ",{"$f":"COUNTIF(Data!$F$6:$F$300,\"Oui\")","v":0}]
[null,"Nombre de residents traites avec Lagevrio qui sont decedes de COVID-19 en maison de repos:",{"$f":"COUNTIF(Data!$G$6:$G$300,\"Oui\")","v":0}]
[null,"Nombre de residents traites avec Lagevrio qui ont ete hospitalises a cause de COVID-19:",{"$f":"COUNTIF(Data!$H$6:$H$300,\"Oui\")","v":0}]
[null,"Nombre de residents traites avec Lagevrio qui sont morts de COVID-19 a l'hopital:",{"$f":"COUNTIF(Data!$I$6:$I$300,\"Oui\")","v":0}]
[]
[]
[null,"Nombre de residents pour lesquels Lagevrio a ete ordonne:"]
[null,"Nombre de residents pour lesquels un traitement par Lagevrio a ete initie :"]
[null,"Nombre de residents pour lesquels le traitement par Lagevrio est complete (au moins 80 %): "]
[null,"Nombre de residents traites avec Lagevrio qui sont decedes de COVID-19 en maison de repos:"]
[null,"Nombre de residents traites avec Lagevrio qui ont ete hospitalises a cause de COVID-19:"]
[null,"Nombre de residents traites avec Lagevrio qui sont morts de COVID-19 a l'hopital:"]
[]
[null,"Remarques:"]
[]
[]
[]
[null,"En appuyant sur le bouton \"envoyer\", vous déclarez avoir vérifié toutes les données et que tous les résidents traités par Lagevrio répondent aux critères décrits dans le POS."]
[null,"La transmission des données doit se faire au plus tôt 2 semaines après la fin du foyer OU 28 jours après la fin du dernier traitement, la date la plus tardive étant retenue. "]

{"sheet":"Lists","index":3,"n_rows":3,"n_cols":4,"rows_kept":3,"cut":false,"hidden":true,"merged":[]}
["Geneesmiddelen","Opgestart","Hospitaal","Overleden"]
["Lagevrio","Oui","Oui","Oui"]
[null,"Non","Non","Non"]